{"text_format":"1","workbook":"xlsx","n_sheets":5,"sheets":["Examenprogramma","Minor","Niveau-indeling vakken","Printen","Temp Stuff"],"not_rendered":{"charts":0,"images":6,"macros":1,"external_links":0,"defined_names":24,"comments":1,"pivot_tables":0},"unopened":[],"bounds":{"document_bytes":16777216,"sheet_cells":100000,"rows_first":2000,"rows_last":500,"rows_between":2000,"halvings":0,"cell_chars":16384,"cell_head_chars":4096},"cells_cut":0,"cells_raw":0,"read":"whole","date_system":"1900"}

{"sheet":"Examenprogramma","index":0,"n_rows":140,"n_cols":14,"rows_kept":140,"cut":false,"hidden":false,"merged":[[130,4,130,7],[131,4,131,7],[118,4,118,7],[137,2,137,7],[116,1,117,7],[121,4,121,7],[122,4,122,7],[123,4,123,7],[124,4,124,7],[125,4,125,7],[126,4,126,7],[127,4,127,7],[128,4,128,7],[129,4,129,7],[115,1,115,5],[119,4,119,7],[120,4,120,7],[3,1,3,4],[6,2,6,7],[7,2,7,7],[8,2,8,7],[9,2,9,7],[107,1,107,5],[13,1,13,4],[13,5,13,7],[22,1,23,4],[22,5,23,7],[27,1,27,4],[27,5,27,7],[44,1,44,4],[54,1,54,4],[74,1,74,4],[95,1,95,4],[10,2,10,7],[109,4,109,5],[99,1,99,4],[99,5,99,7],[108,6,108,7],[109,6,109,7],[22,9,22,11],[15,9,15,11],[17,9,17,11],[18,9,18,11],[19,9,19,11],[21,9,21,11],[20,9,20,11]]}
[]
[null,"Aanvraag goedkeuring bachelorprogramma Science"]
[null,"Cohorten 2011, 2012, 2013, 2014, 2015, 2016, 2017"]
[]
[null,"Wanneer je het formulier correct hebt ingevuld, mail het dan (in dit format) naar: fnwi.examcies@science.ru.nl"]
[]
[null,"Naam:"]
[null,"Studentnummer: "]
[null,"E-mail:"]
[null,"Telefoon:"]
[null,"Startjaar Studie:"]
[null,"Profiel","Keuzemenu"]
[]
[null,"Verplichte cursussen (21 EC)",null,null,null,"Aanpassingen aan de verplichte ruimte:"]
[null,"Code","Cursus naam","EC","Bijz.","Code","Cursus","EC",null,null,null,null,"Nee",{"$f":"SUMIFS(D16,E16,\"<>N.V.\",H16,\"\")","v":6}]
[null,"NWI-MOL092","Panorama science: Energy",6,"Nee",null,null,null,null,"Vul bij Bijzonderheden in:",null,null,"Vrij",{"$f":"SUMIFS(D17,E17,\"<>N.V.\",H17,\"\")","v":6}]
[null,"NWI-MOL099","Panorama science: Health and food",6,"Nee",null,null,null,null,null,null,null,"N.V.",{"$f":"SUMIFS(D18,E18,\"<>N.V.\",H18,\"\")","v":3}]
[null,"NWI-FCEM02B","Schrijfvaardigheid",3,"Nee",null,null,null,null,"'Vrij'als het om een vrijstelling gaat",null,null,null,{"$f":"SUMIFS(D19,E19,\"<>N.V.\",H19,\"\")","v":3}]
[null,"NWI-FFIL100/101","Inleiding Filosofie en Ethiek",3,"Nee",null,null,null,null,"òf",null,null,null,{"$f":"SUMIFS(D20,E20,\"<>N.V.\",H20,\"\")","v":3}]
[null,"NWI-MOL086","Academische Vorming",3,"Nee",null,null,null,null,"'N.V.' als het om een "]
[null,null,"Totaal:",{"$f":"SUM(Examenprogramma!N15:N19)+SUM(H16:H20)","v":21},null,null,null,null,null,"voor jouw niet verplicht vak gaat"]
[null,null,null,null,null,null,null,null,null,"òf"]
[null,"Kies minor (optioneel):",null,null,null,null,null,null,null,"'Nee' In alle andere gevallen"]
[]
[]
[]
[]
[null,"Minor (15-30 EC)",null,null,null,"Aanpassingen aan de minor:"]
[null,"Code","Cursus naam","EC","Bijz.","Code","Cursus","EC"]
[null,null,null,{"$f":"\"\"","v":""},"Nee",null,null,null,null,null,null,null,null,{"$f":"SUMIFS(D30,E30,\"<>N.V.\",H30,\"\")","v":0}]
[null,null,{"$f":"\"\"","v":""},{"$f":"\"\"","v":""},"Nee",null,null,null,null,null,null,null,null,0]
[null,null,{"$f":"\"\"","v":""},{"$f":"\"\"","v":""},"Nee",null,null,null,null,null,null,null,null,0]
[null,null,{"$f":"\"\"","v":""},{"$f":"\"\"","v":""},"Nee",null,null,null,null,null,null,null,null,0]
[null,null,{"$f":"\"\"","v":""},{"$f":"\"\"","v":""},"Nee",null,null,null,null,null,null,null,null,0]
[null,null,{"$f":"\"\"","v":""},{"$f":"\"\"","v":""},"Nee",null,null,null,null,null,null,null,null,0]
[null,null,{"$f":"\"\"","v":""},{"$f":"\"\"","v":""},"Nee",null,null,null,null,null,null,null,null,0]
[null,null,{"$f":"\"\"","v":""},{"$f":"\"\"","v":""},"Nee",null,null,null,null,null,null,null,null,0]
[null,null,{"$f":"\"\"","v":""},{"$f":"\"\"","v":""},null,null,null,null,null,null,null,null,null,0]
[null,null,{"$f":"\"\"","v":""},{"$f":"\"\"","v":""},null,null,null,null,null,null,null,null,null,0]
[null,"Minor:","Vul hier de naam van je minor in",null,null,null,null,null,null,null,null,null,null,0]
[null,null,"Totaal:",{"$f":"SUM(Examenprogramma!N30:N40)+SUM(H30:H40)","v":0}]
[]
[]
[]
[null,"Niveau 1 cursussen (maximaal 15 EC)"]
[null,"Code","Cursusnaam (klik voor een keuzelijst)","EC","Bijz.","Practicum"]
[null,{"$f":"INDEX(niveau1_cc,MATCH(Examenprogramma!C47,niveau_1,0))","v":""},"Kies een cursus",{"$f":"INDEX(niveau1_ec,MATCH(Examenprogramma!C47,niveau_1,0))","v":""},"Nee",{"$f":"VLOOKUP(B47,prac_niveau_1,4,FALSE)","v":""},null,null,null,null,null,null,null,0]
[null,{"$f":"INDEX(niveau1_cc,MATCH(Examenprogramma!C48,niveau_1,0))","v":""},"Kies een cursus",{"$f":"INDEX(niveau1_ec,MATCH(Examenprogramma!C48,niveau_1,0))","v":""},"Nee",{"$f":"VLOOKUP(B48,prac_niveau_1,4,FALSE)","v":""},null,null,null,null,null,null,null,0]
[null,{"$f":"INDEX(niveau1_cc,MATCH(Examenprogramma!C49,niveau_1,0))","v":""},"Kies een cursus",{"$f":"INDEX(niveau1_ec,MATCH(Examenprogramma!C49,niveau_1,0))","v":""},"Nee","",null,null,null,null,null,null,null,0]
[null,{"$f":"INDEX(niveau1_cc,MATCH(Examenprogramma!C50,niveau_1,0))","v":""},"Kies een cursus",{"$f":"INDEX(niveau1_ec,MATCH(Examenprogramma!C50,niveau_1,0))","v":""},"Nee","",null,null,null,null,null,null,null,0]
[null,{"$f":"INDEX(niveau1_cc,MATCH(Examenprogramma!C51,niveau_1,0))","v":""},"Kies een cursus",{"$f":"INDEX(niveau1_ec,MATCH(Examenprogramma!C51,niveau_1,0))","v":""},"Nee","",null,null,null,null,null,null,null,0]
[null,{"$f":"INDEX(niveau1_cc,MATCH(Examenprogramma!C52,niveau_1,0))","v":""},"Kies een cursus",{"$f":"INDEX(niveau1_ec,MATCH(Examenprogramma!C52,niveau_1,0))","v":""},"Nee","",null,null,null,null,null,null,null,0]
[null,null,"Totaal:",{"$f":"SUM(Examenprogramma!N47:N52)+SUM(H47:H52)","v":0}]
[]
[null,"Niveau 2 cursussen"]
[null,"Code","Cursusnaam (klik voor een keuzelijst)","EC","Bijz.","Practicum"]
[null,{"$f":"INDEX(niveau2_cc,MATCH(Examenprogramma!C57,niveau_2,0))","v":""},"Kies een cursus",{"$f":"INDEX(niveau2_ec,MATCH(Examenprogramma!C57,niveau_2,0))","v":""},"Nee",{"$f":"VLOOKUP(B57,prac_niveau_2,4,FALSE)","v":""},null,null,null,null,null,null,null,0]
[null,{"$f":"INDEX(niveau2_cc,MATCH(Examenprogramma!C58,niveau_2,0))","v":""},"Kies een cursus",{"$f":"INDEX(niveau2_ec,MATCH(Examenprogramma!C58,niveau_2,0))","v":""},"Nee","",null,null,null,null,null,null,null,0]
[null,{"$f":"INDEX(niveau2_cc,MATCH(Examenprogramma!C59,niveau_2,0))","v":""},"Kies een cursus",{"$f":"INDEX(niveau2_ec,MATCH(Examenprogramma!C59,niveau_2,0))","v":""},"Nee","",null,null,null,null,null,null,null,0]
[null,{"$f":"INDEX(niveau2_cc,MATCH(Examenprogramma!C60,niveau_2,0))","v":""},"Kies een cursus",{"$f":"INDEX(niveau2_ec,MATCH(Examenprogramma!C60,niveau_2,0))","v":""},"Nee","",null,null,null,null,null,null,null,0]
{"$rows_left_out":81}
{"sheet":"Minor","index":1,"n_rows":945,"n_cols":11,"rows_kept":945,"cut":false,"hidden":false,"merged":[]}
[null,"Minoren",null,null,"n"]
[null,"Code","Cursus","EC"]
[false,"Nanoscience",null,null,"Minor 1"]
[{"$f":"COUNTIF(C3:C22,\"<>\"&\"\")+1","v":8},"NWI-NP007B","Speciale Relativiteitstheorie",3,"Nee"]
[31,"NWI-MOL039 ","Fysisch Practicum",6,"Nee"]
[null,"NWI-NP027B","Inleiding Nanowetenschap & Technologie",3,"Nee"]
[null,"NWI-NB044B","Nanofysica",3,"Nee"]
[null,"NWI-NB071B","Structuur der Materie: Atoom en Molecuulfysica",3,"Nee"]
[null,"NWI-NB072B","Structuur der Materie: Vaste Stof Fysica",3,"Nee"]
[null,"NWI-NB029B","Electronica",3,"Nee"]
[]
[]
[]
[]
[]
[]
[]
[]
[]
[]
[]
[]
[false,"Milieuchemie",null,null,"Minor 2"]
[{"$f":"COUNTIF(C23:C42,\"<>\"&\"\")+1","v":8},"NWI-NB046B","Chemie en Fysica van de Atmosfeer",3]
[31,"NWI-MB021B","Geografische Informatiesystemen",6]
[null,"NWI-MOL054","Toxicologie",6]
[null,"NWI-MB024C","HERA (Environmental Risk Assessment)",6]
[null,"NWI-MOL091","Green Chemistry",3]
[null,"NWI-MOL065","Chemometrie",6]
[null,"NWI-BB082B","Keuze: Milieuchemie en Toxicologie",3]
[]
[]
[]
[]
[]
[]
[]
[]
[]
[]
[]
[]
[false,"Educatie - 30 ec",null,null,"Minor 3"]
[{"$f":"COUNTIF(C43:C62,\"<>\"&\"\")+1","v":3},null,"Educatieve Minor",30,"Nee"]
[31]
[]
[]
[]
[]
[]
[]
[]
[]
[null,"Minor:","Educatie"]
[]
[]
[]
[]
[]
[]
{"$rows_left_out":886}
{"sheet":"Niveau-indeling vakken","index":2,"n_rows":158,"n_cols":23,"rows_kept":158,"cut":false,"hidden":false,"merged":[]}
["","","NIVEAU 1","",null,null,"","","NIVEAU 2","","","","","","NIVEAU 3","","","",null,null,null,null,"PROFIELEN"]
["",{"$f":"\"\"","v":""},"Kies een cursus","Nee",null,null,"",{"$f":"\"\"","v":""},"Kies een cursus","Nee",null,null,"",{"$f":"\"\"","v":""},"Kies een cursus","Nee",null,"Kies: stageafdeling",null,null,null,null,"Keuzemenu"]
["","","","",null,null,null,"","","",null,null,"","","","",null,null,null,null,null,null,"Chemisch / Biologisch"]
[null,"EC","BIOLOGIE","Practicum?",null,null,null,"EC","BIOLOGIE","Practicum?",null,null,null,"EC","BIOLOGIE","Practicum?",null,"DCN-Biological Psychology",null,null,null,null,"Chemisch / Fysisch"]
["NWI-BP027B",6,"Biodiversiteit ","Nee",null,null,"NWI-BB087",6,"Advanced Population and Evolution Biology","Nee",null,null,"NWI-BB020B",6,"Adaptatiefysiologie ","Nee",null,"DCN-Biophysics",null,null,null,null,"Fysisch / Biologisch"]
["NWI-BP003B",6,"Evolutie & ontwikkelingsbiologie van de planten ","Nee",null,null,"NWI-BB079B",3,"Biologie en duurzame ontwikkeling","Nee",null,null,"NWI-BB020B",6,"Adaption Physiology","Nee",null,"DCN-Cognitive Neuroscience/Molecular Neurophysiology"]
["NWI-BP004C",6,"Evolutie en Adaptaties van Dieren ","Nee",null,null,"NWI-BB011B",3,"Biologie en Samenleving ","Nee",null,null,"NWI-BB023B",6,"Animal Cell Biology","Nee",null,"DCN-Neurophysiology"]
["NWI-BP006B",3,"Functionele Cytologie en Histologie ","Nee",null,null,"NWI-BB050C",6,"Conservation Genetics ","Nee",null,null,"NWI-BB027C",6,"Applied and Environmental Microbiology ",1,null,"IMAPP-Astrophysics"]
["NWI-BP011B",6,"Genetica & Populatiegenetica ","Nee",null,null,"NWI-BB060B",6,"Dierecologie ","Nee",null,null,"NWI-BB051B",6,"Applied Bioinformatics ","Nee",null,"IMM-Analytical Chemistry "]
["NWI-BP029B",3,"Geomicrobiologie","Nee",null,null,"NWI-BB005B",6,"Dierfysiologie ",0.5,null,null,"NWI-BB036B",6,"Applied Ecology ","Nee",null,"IMM-Applied Materials Science"]
["NWI-BP019B",3,"Humane biologie ","Nee",null,null,"NWI-BB083B",6,"Ecological Theory and Data Analysis ","Nee",null,null,"NWI-BB017C",6,"Biochemistry and Molecular Biology II ","Nee",null,"IMM-Biomolecular Chemistry"]
["NWI-BP025B",3,"Humane Functionele Histologie ","Nee",null,null,"NWI-BB082B",3,"Environmental Chemistry and Toxicology","Nee",null,null,"NWI-BB070B",3,"Biologie van Micro-organismen ",0.5,null,"IMM-Bio-Organic Chemistry"]
["NWI-BP029C",3,"Microbiologie: Evol., Divers. en Adapt.","Nee",null,null,"NWI-BB040B",6,"Evolutiebiologie","Nee",null,null,"NWI-BB032B",6,"Biotechnology of Plants ",1,null,"IMM-Biophysical Chemistry "]
["NWI-BP029D",6,"Microbiology ","Nee",null,null,"NWI-BB028B",3,"Geschiedenis van de Biologie","Nee",null,null,"NWI-BB085B",6,"Brain and Behaviour","Nee",null,"IMM-Molecular Nanotechnology"]
["NWI-BP010B",6,"Moleculaire Biologie & Recombinant DNA ",1,null,null,"NWI-BB028B",3,"History of Biology ","Nee",null,null,"NWI-BB074B",6,"Brain, dynamics and connectivity","Nee",null,"IMM-Molecular Structure and Dynamics"]
["NWI-BP004B",6,"Ontwikkeling en evolutie in de bouwplannen van dieren","Nee",null,null,"NWI-BB047C",6,"Human Embryology and Developmental Biology ","Nee",null,null,"NWI-BB023B",6,"Celbiologie van Dieren ","Nee",null,"IMM-Physical Organic Chemistry"]
["NWI-BP013B",3,"Organisme en milieu ","Nee",null,null,"NWI-BB025B",6,"Human Pathology","Nee",null,null,"NWI-BB081B",6,"Cognitive Neuroimaging ","Nee",null,"IMM-Scanning Probe Microscopy"]
["NWI-BP026B",3,"Pathobiologie ","Nee",null,null,"NWI-BB025B",6,"Medische pathologie ","Nee",null,null,"NWI-BB060B",6,"Dierecologie","Nee",null,"IMM-Soft condensed matter and nanomaterials in high magnetic fields"]
["NWI-BP015B",3,"Populatie- en evolutiebiologie ","Nee",null,null,"NWI-BB071B",3,"Mens en Milieu ","Nee",null,null,"NWI-BB018C",6,"Ecofysiologie ","Nee",null,"IMM-Solid State Chemistry "]
["NWI-BP012B",3,"Statistiek ","Nee",null,null,"NWI-BB082B",3,"Milieuchemie en toxicologie","Nee",null,null,"NWI-BB018B",6,"Ecofysiologie van Planten","Nee",null,"IMM-Solid State NMR "]
["NWI-BB079C",3,"Water, Health & Development ","Nee",null,null,"NWI-BB021B",6,"Neurobiofysica ","Nee",null,null,"NWI-BB027C",6,"Ecologische microbiologie",1,null,"IMM-Spectroscopy of Solids and Interfaces"]
[null,null,null,null,null,null,"NWI-BB039C",6,"Neurodevelopment ","Nee",null,null,"NWI-BB048B",6,"Endocrinologie ","Nee",null,"IMM-Synthetic Organic Chemistry "]
[null,null,"MOLECULAIR",null,null,null,"NWI-BB061C",6,"Neuropsychologie","Nee",null,null,"NWI-BB064B",6,"Functional Genomics ","Nee",null,"IMM-Theoretical Chemistry "]
["NWI-MOL022",3,"Aspects of molecular life sciences ","Nee",null,null,"NWI-BB063B",6,"Neuroscience: from Basics to Clinic ","Nee",null,null,"NWI-BB086",12,"Genomics for Health and Environment",1,null,"IMM-Theory of Condensed Matter"]
["NWI-MOL008A",6,"Biochemistry","Nee",null,null,"NWI-BB065B",6,"Pathofysiologie van de nier ","Nee",null,null,"NWI-BB043B",12,"Genoomanalyse van planten","Nee",null,"IWWR-Organismal Animal Physiology"]
["NWI-MOL010",6,"Biochemistry Project ",1,null,null,"NWI-BB069B",6,"Plantenfysiologie ",0.5,null,null,"NWI-MB021B",6,"Geographic Information Systems ","Nee",null,"RIMLS-Biochemistry"]
["NWI-MOL021",6,"Cell biophysics project ","Nee",null,null,"NWI-BB077B",3,"Statistiek II ","Nee",null,null,"NWI-BB085B",6,"Hersenen en Gedrag ","Nee",null,"RIMLS-Bioinformatics (CMBI )"]
["NWI-MOL014",3,"Electricity and Magnetism 1A ","Nee",null,null,null,null,null,null,null,null,"NWI-BB078B",3,"Hersenen en gedrag: sensomotoriek","Nee",null,"RIMLS-Cell Biology"]
["NWI-MOL025",3,"Electricity and magnetism 2A","Nee",null,null,null,null,"MOLECULAIR",null,null,null,"NWI-MB024C",6,"Human and Ecological Risk Assessment ","Nee",null,"RIMLS-Molecular Neurogenetics"]
["NWI-MOL077",3,"Energiemetabolismen","Nee",null,null,"NWI-MOL036",3,"Algemene fysiologie ","Nee",null,null,"NWI-BB019B",6,"Immunology ","Nee",null,"RIMLS-Molecular Pharmacology and Toxicology "]
["NWI-MOL020",3,"Environmental Chemistry and Sustainability ","Nee",null,null,"NWI-MOL022",3,"Aspecten van de moleculaire levenswetenschappen","Nee",null,null,"NWI-BB031B",6,"Medische biotechnologie","Nee",null,"RIMLS-Physiology"]
["NWI-MOL024",3,"Fourieranalyse en mechanische golven","Nee",null,null,"NWI-MOL031",3,"Biochemistry in the Living cell ","Nee",null,null,"NWI-BB084B",6,"Molecular Principles of Development ","Nee",null,"RIMLS-Tumorimmunology"]
["NWI-MOL003",3,"Mechanics 1A ","Nee",null,null,"NWI-MOL029",3,"Bioinformatica ","Nee",null,null,"NWI-BB034B",6,"Neurobiology ","Nee"]
["NWI-MOL012",3,"Mechanics 2A ","Nee",null,null,"NWI-MOL075",3,"Bioinformatics A ","Nee",null,null,"NWI-BB080B",6,"Neurophysiology of Cognition and Behaviour ","Nee"]
["NWI-MOL098",3,"Object orientatie ","Nee",null,null,"NWI-MOL043",3,"Bio-inorganic chemistry ","Nee",null,null,"NWI-BB024B",6,"Physiology of Micro organisms ",0.5]
["NWI-MOL006",3,"Project reacties en kinetiek",1,null,null,"NWI-MOL049A",3,"Chemical biology project","Nee",null,null,"NWI-BB043B",6,"Plant Genome Analysis ",1]
["NWI-MOL005",6,"Reactions and Kinetics Project ","Nee",null,null,"NWI-MOL097",3,"Chemical Neuroscience","Nee",null,null,"NWI-BB022B",6,"Systeemecologie ","Nee"]
["NWI-MOL019",3,"Spectroscopic Techniques ","Nee",null,null,"NWI-MOL035",3,"Chemie en samenleving ","Nee",null,null,"NWI-MB023B",6,"Water- en natuurbeheer ","Nee"]
["NWI-MOL018",6,"Thermodynamics Project ",1,null,null,"NWI-MOL030",3,"Coördinatiechemie","Nee"]
[null,null,null,null,null,null,"NWI-MOL032",3,"Crystal Structure ","Nee",null,null,null,null,"MOLECULAIR"]
[null,null,null,null,null,null,"NWI-MOL027",3,"DNA Technology ",0.5,null,null,"NWI-MOL110",3,"Applied Magnetic Resonace","Nee"]
[null,null,"NATUURKUNDE",null,null,null,"NWI-MOL061",3,"Electromagnetisme A","Nee",null,null,"NWI-MOL111",3,"Biophysical Chemistry","Nee"]
["NWI-NP037",6,"Elektriciteit en Magnetisme","Nee",null,null,"NWI-MOL042",3,"Fourier analyse ","Nee",null,null,"NWI-MOL056",3,"Chemische Binding ","Nee"]
["NWI-NP019B",3,"Elektriciteit en Magnetisme 1B ","Nee",null,null,"NWI-MOL042",3,"Fourier analysis","Nee",null,null,"NWI-MOL065",6,"Chemometrics ","Nee"]
["NWI-NP020B",3,"Elektriciteit en Magnetisme 2B ","Nee",null,null,"NWI-MOL039",6,"Fysisch practicum ",1,null,null,"NWI-MOL109",6,"Chemometrics for Molecular Life Sciences ","Nee"]
["NWI-NP029B",3,"Elementaire Deeltjes ","Nee",null,null,"NWI-MOL036",3,"General Physiology","Nee",null,null,"NWI-MOL073",3,"Comparative genomics ","Nee"]
["NWI-NP021D",3,"Golven en Optica ","Nee",null,null,"NWI-MOL038",3,"Genetica ","Nee",null,null,"NWI-MOL050",3,"Condensed Matter ","Nee"]
["NWI-NP022B",3,"Inleiding Kwantummechanica ","Nee",null,null,"NWI-MOL105",3,"Inorganic biochemistry ","Nee",null,null,"NWI-MOL068",3,"Electromagnetisme B","Nee"]
["NWI-NP027B",3,"Inleiding Nanowetenschap en Technologie ","Nee",null,null,"NWI-MOL102",3,"Inorganic Chemistry ","Nee",null,null,"NWI-MOL091",3,"Green Chemistry ","Nee"]
["NWI-NP032B",3,"Inleiding Neuroscience ","Nee",null,null,"NWI-MOL044",3,"Inorganic Chemistry Laboratory ",1,null,null,"NWI-MOL074",3,"Inleiding in de Neuroimaging technieken","Nee"]
["NWI-NP015B",3,"Kaleidoscoop Sterrenkunde ","Nee",null,null,"NWI-MOL016",3,"Lineaire algebra ","Nee",null,null,"NWI-MOL058",3,"Introduction to magnetic resonance","Nee"]
["NWI-NP009C",3,"Lineaire Algebra 1 ","Nee",null,null,"NWI-MOL108",3,"Magnetic Resonance in chemistry ","Nee",null,null,"NWI-MOL071",3,"Kristalgroei ","Nee"]
["NWI-NP010B",3,"Lineaire Algebra 2 ","Nee",null,null,"NWI-MOL045",3,"Microscopic Techniques","Nee",null,null,"NWI-MOL057",6,"Magnetic Resonance ","Nee"]
["NWI-NP011B",3,"Lineaire Algebra 3 ","Nee",null,null,"NWI-MOL045",3,"Microscopische technieken ","Nee",null,null,"NWI-MOL104",6,"Medical biotechnology ","Nee"]
["NWI-NP012B",3,"Lineaire Algebra 4 ","Nee",null,null,"NWI-MOL037",3,"Moleculaire levenswetenschappen & samenleving ","Nee",null,null,"NWI-MOL096",3,"Metal Organic Chemistry ","Nee"]
["NWI-NP011C",3,"Lineaire Algebra NS","Nee",null,null,"NWI-MOL037",3,"Molecular Life Sciences and Society","Nee",null,null,"NWI-MOL055",6,"Molecular Basis of Diseases ","Nee"]
["NWI-NP035",6,"Lineaire Mechanica","Nee",null,null,"NWI-MOL034",3,"Practicum gecondenseerde materie ",1,null,null,"NWI-MOL078",6,"Nanobiotechnology ","Nee"]
["NWI-NP001B",3,"Mechanica 1B ","Nee",null,null,"NWI-MOL081",3,"Practicum NMR",1,null,null,"NWI-MOL095",6,"Organic Chemistry ","Nee"]
["NWI-NP002B",3,"Mechanica 2B ","Nee",null,null,"NWI-MOL033",3,"Programmeren in Matlab ","Nee",null,null,"NWI-MOL048A",6,"Organic chemistry laboratory ",1]
["NWI-NP021C",3,"Mechanische Golven","Nee",null,null,"NWI-MOL085",3,"Programmeren Matlab NW","Nee",null,null,"NWI-MOL053",6,"Pharmacochemistry","Nee"]
{"$rows_left_out":99}
{"sheet":"Printen","index":3,"n_rows":140,"n_cols":8,"rows_kept":140,"cut":false,"hidden":false,"merged":[[27,1,27,4],[27,5,27,7],[3,1,3,4],[12,1,12,4],[12,5,12,7],[22,1,23,4],[22,5,23,7],[44,1,44,4],[44,5,44,7],[54,1,54,4],[54,5,54,7],[75,1,75,4],[75,5,75,7],[111,4,111,5],[111,6,111,7],[117,1,117,5],[95,1,95,4],[95,5,95,7],[103,1,103,4],[103,5,103,7],[109,1,109,5],[110,6,110,7]]}
[]
[null,"Aanvraag goedkeuring bachelorprogramma Science"]
[null,"Cohorten 2011, 2012, 2013, 2014, 2015, 2016"]
[]
[]
[]
[null,"Naam:"]
[null,"Studentnummer: "]
[null,"E-mail:"]
[null,"Telefoon:"]
[null,"Startjaar Studie:"]
[]
[null,"Verplichte cursussen (21 EC)",null,null,null,"Aanpassingen aan de verplichte ruimte:"]
[null,"Code","Cursus naam","EC","Bijz.","Code","Cursus","EC"]
[null,"NWI-MOL092","Panorama science: Energy",6,"Nee"]
[null,"NWI-MOL099","Panorama science: Health and food",6,"Nee"]
[null,"NWI-FCEM02B","Schrijfvaardigheid",3,"Nee"]
[null,"NWI-FFIL100/101","Inleiding Filosofie en Ethiek",3,"Nee"]
[null,"NWI-MOL086","Academische Vorming",3,"Nee"]
[null,null,"Totaal:",21]
[]
[]
[null,"Kies minor (optioneel):"]
[]
[]
[]
[]
[null,"Minor (15-30 EC)",null,null,null,"Aanpassingen aan de minor:"]
[null,"Code","Cursus naam","EC","Bijz.","Code","Cursus","EC"]
[]
[]
[]
[]
[]
[]
[]
[]
[]
[]
[]
[null,null,"Totaal:",0]
[]
[]
[]
[null,"Niveau 1 cursussen (maximaal 15 EC)",null,null,null,"Aanpassingen aan de cursussen:"]
[null,"Code","Cursus naam (klik voor een keuzelijst)","EC","Bijz.","Code","Cursus","EC"]
[null,{"$f":"INDEX('Niveau-indeling vakken'!A:A,MATCH(Examenprogramma!C47,niveau_1,0))","v":""},"Kies een cursus",{"$f":"INDEX('Niveau-indeling vakken'!B:B,MATCH(Examenprogramma!C47,niveau_1,0))","v":""},"Nee"]
[null,{"$f":"INDEX('Niveau-indeling vakken'!A:A,MATCH(Examenprogramma!C48,niveau_1,0))","v":""},"Kies een cursus",{"$f":"INDEX('Niveau-indeling vakken'!B:B,MATCH(Examenprogramma!C48,niveau_1,0))","v":""},"Nee"]
[null,{"$f":"INDEX('Niveau-indeling vakken'!A:A,MATCH(Examenprogramma!C49,niveau_1,0))","v":""},"Kies een cursus",{"$f":"INDEX('Niveau-indeling vakken'!B:B,MATCH(Examenprogramma!C49,niveau_1,0))","v":""},"Nee"]
[null,{"$f":"INDEX('Niveau-indeling vakken'!A:A,MATCH(Examenprogramma!C50,niveau_1,0))","v":""},"Kies een cursus",{"$f":"INDEX('Niveau-indeling vakken'!B:B,MATCH(Examenprogramma!C50,niveau_1,0))","v":""},"Nee"]
[null,{"$f":"INDEX('Niveau-indeling vakken'!A:A,MATCH(Examenprogramma!C51,niveau_1,0))","v":""},"Kies een cursus",{"$f":"INDEX('Niveau-indeling vakken'!B:B,MATCH(Examenprogramma!C51,niveau_1,0))","v":""},"Nee"]
[null,{"$f":"INDEX('Niveau-indeling vakken'!A:A,MATCH(Examenprogramma!C52,niveau_1,0))","v":""},"Kies een cursus",{"$f":"INDEX('Niveau-indeling vakken'!B:B,MATCH(Examenprogramma!C52,niveau_1,0))","v":""},"Nee"]
[null,null,"Totaal:",0]
[]
[null,"Niveau 2 cursussen",null,null,null,"Aanpassingen aan de cursussen;"]
[null,"Code","Cursus naam (klik voor een keuzelijst)","EC","Bijz.","Code","Cursus","EC"]
[null,{"$f":"INDEX('Niveau-indeling vakken'!G:G,MATCH(Examenprogramma!C57,niveau_2,0))","v":""},"Kies een cursus",{"$f":"INDEX('Niveau-indeling vakken'!H:H,MATCH(Examenprogramma!C57,niveau_2,0))","v":""},"Nee"]
[null,{"$f":"INDEX('Niveau-indeling vakken'!G:G,MATCH(Examenprogramma!C58,niveau_2,0))","v":""},"Kies een cursus",{"$f":"INDEX('Niveau-indeling vakken'!H:H,MATCH(Examenprogramma!C58,niveau_2,0))","v":""},"Nee"]
[null,{"$f":"INDEX('Niveau-indeling vakken'!G:G,MATCH(Examenprogramma!C59,niveau_2,0))","v":""},"Kies een cursus",{"$f":"INDEX('Niveau-indeling vakken'!H:H,MATCH(Examenprogramma!C59,niveau_2,0))","v":""},"Nee"]
[null,{"$f":"INDEX('Niveau-indeling vakken'!G:G,MATCH(Examenprogramma!C60,niveau_2,0))","v":""},"Kies een cursus",{"$f":"INDEX('Niveau-indeling vakken'!H:H,MATCH(Examenprogramma!C60,niveau_2,0))","v":""},"Nee"]
{"$rows_left_out":81}
{"sheet":"Temp Stuff","index":4,"n_rows":29,"n_cols":3,"rows_kept":29,"cut":false,"hidden":true,"merged":[]}
[]
[]
[]
[]
[]
[]
[]
[]
[]
[]
[]
[]
[]
[]
[]
[]
["NWI-WB008C",null,"Logica "]
["NWI-WB011C",null,"Discrete Wiskunde "]
["NWI-WB012B",null,"Ringen en Lichamen "]
[]
["NWI-WB045C",null,"Differentiaalmeetkunde "]
[]
["NWI-WB079C",null,"Manifolds "]
["NWI-WB086",null,"Groepen en Representaties "]
["NWI-WB087",null,"Game Theory "]
["NWI-WB088",null,"Maattheorie "]
["NWI-WB089",null,"Getaltheorie "]
["NWI-WB090",null,"Portfolio Theory "]
["NWI-WB091",null,"Modular Forms "]